site stats

Expected initializer before p

WebSep 16, 2014 · I can't seem to find any errors in my code (although I'm sure there is), but when I try to compile I get multiple errors on my output printf statements that say both expected ';' before ')' token and expected statement before ')' token. I must be blind. Please enlighten me. int main (void) { int i=0,sum=0,tries=0; int mean=sum/tries; do ... WebOct 12, 2016 · prog3.cpp:10:1: error: expected initializer before ‘int’ int main ^ this is what i get when i run this program please any help regarding this it will be much appreciated and please tell me if i made this program workable like with boolean expression if the function and prototype are well declared and performing together

arduino uno - Expected Initializer? - Arduino Stack Exchange

WebMar 27, 2016 · For starters, int currentLED is not a valid C++ declaration: you're missing a semicolon. On the other hand, void setup();{} has an extra semicolon which should be removed. – Dmitry Grigoryev WebSep 22, 2024 · expected primary-expression before '.' tokenve tried a new code for the DHT 11 sensor. now I keep getting an expected primary expression error for a serial.println bit of code. DKWatson September 22, 2024, 1:04pm 15 Wow! Lots of errors. Any code to relate them to? Ripcrow September 22, 2024, 1:11pm 16 uin women\u0027s painted canvas shoes https://corcovery.com

C++ template - error: expected initializer before

WebFeb 20, 2012 · 1 2 3 4 5 6 7 8 9 10 11 12 13 14 15 16 17 18 19 20 21 22 23 24 25 26 27 28 29 30 31 32 33 34 35 36 37 38 39 40 41 42 43 44 45 46 47 48 49 50 51 52 53 54 55 56 57 58 ... WebAug 19, 2012 · 2 Answers. Most likely, in the header file you include immediately before class.h, you'll have something like: without the closing semi-colon. That will make your code sequence: class xyzzy { int plugh; } class Account { public: double dAccountBalance; double dAccountChange (double dChange); }; WebMay 5, 2024 · static inline void BicycleComputer::trigger_hallsensor () { count++; distance += ( (double)BC_TIRE_CIRC)/1000000.0; } Why are you trying to inline this? … uio-66 cysteine ir spectra

C++ error: expected initialiser before

Category:[SOLVED] Expected initializer before - Arduino Forum

Tags:Expected initializer before p

Expected initializer before p

107280 – [10/11 Regression] ICE: tree check: expected …

WebAug 6, 2024 · C++ Complie Error: expected initializer before ‘+=’ token. Hot Network Questions Is the forced labor prison in Andor human only? Fix Kerning Internal to a … WebJul 15, 2012 · Unfortunately since the respective constructor is explicit and vector has an initializer list constructor, you need a functional cast to call the wanted constructor. ... Enum error: expected identifier before numeric constant. 0 [Error]expected identifier before numeric constant.-setlocale. 1.

Expected initializer before p

Did you know?

WebMar 26, 2012 · error expected initializer before < token Ask Question Asked 11 years ago Modified 11 years ago Viewed 6k times 1 I am overloading the assignment operator, and am getting this error. Cannot solve it. Here is the prototype inside template class binTree binTree & operator = ( const binTree & ); // assignment operator Here is the method WebFeb 1, 2012 · It may be that you include a header (just before making the namespace video declaration) that doesn't terminate a structure definition, for example. Go and check that all of your struct s and class es have a semicolon after the closing curly brace in your headers and source files. Similarly any variable declarations, e.g.

WebMay 5, 2024 · It's a macro whose expansion is wreaking havoc on your code. Yeah sorry about that it was originally only count++; I changed parts of the code, here is all of my updated code: Test_nextion.h: #include "DF_Player.h" const byte numChars = 32; char receivedChars [numChars]; char tempChars [numChars]; // temporary array for use … WebJul 3, 2024 · expected initializer before 'serial' Arduino programming code Error.this erro occurs in arduino code due to a missing bracket. if you are looking for arduino...

WebJan 13, 2024 · initializer:在这里是分号的意思。 网上很多人把这个误会为‘初始化’,从而引导去头文件找错误,这个是错误的引导。希望你可以搜索到我的答案,也期望百度能智 … WebApr 10, 2024 · Look closely at your end_game() function in your ufo_functions.hpp file. If you don’t see it, click the spoiler below: Missing ; at the end of your end_game(std::string …

WebDec 22, 2024 · This question was caused by a typo or a problem that can no longer be reproduced. While similar questions may be on-topic here, this one was resolved in a way less likely to help future readers.

WebMar 15, 2024 · Before, we called cp_fully_fold_init, so e.g. {.str=VIEW_CONVERT_EXPR("")} was folded into {.str=""} but now we don't fold and keep the VCE around, and it causes trouble in cxx_eval_store_expression: in the !refs->is_empty loop we descend on .str's initializer but since it's wrapped in a VCE, we skip … u in velocityWebApr 15, 2012 · You can't put a #include of a system header file between a function signature and its body. Change it to: #include double SRK (double Tr, double Pr, double acc) {. In general, your #include lines should go at the top of your .cpp file, before any of your code. Share. uio-66 aqueous synthesisWebOct 1, 2024 · Expected initializer before 'void'. I'm doing a school project and I got everything working exept this. I keep getting 'Expected initializer before void' but I've checked it probably 50 times and I don't see how's that wrong. #include "Hora.h" #include void CargaHora (Hora &hor) { printf ("Ingresar la hora\n"); scanf … thomas rassos estate lawyerWeblab2.cc:11: error: expected initializer before create lab2.cc:20: error: expected constructor, destructor, or type conversion before str_compare Compilation failed. Both errors are tied to the function declarations. (round 11 is the declaration of function create, round 20 - of … thomas rath gmbh \u0026 co. kgWebEEPROMAnything.h:15: error: 'p' was not declared in this scope EEPROMAnything.h:15: error: expected primary-expression before ')' token EEPROMAnything.h:15: error: expected primary-expression before 'void' Not sure what I'm missing in this set. Would love feedback! Thanks thomas rath devils moorWebDec 1, 2014 · binaryTree.h:257: error: expected initializer before ‘<’ token. The function definitions for createList () and inorderToList () are the ones are line 250 and 257 respectively. So I'm a little confused as to what I'm doing wrong here, and sure it's something simple. using namespace std; you should never put this in a header file, but … thomas rathbone potteryWebMar 13, 2024 · [error] expected initializer before 'void' 这个错误是因为在代码中出现了一个语法错误,导致编译器无法识别代码。具体来说,这个错误提示说在某个位置上应该有一个初始化器,但是却出现了一个 void 关键字,这是不合法的。 要解决这个错误,需要检查代码中 … thomas rath hse24 online shopping